Reaction Details
TargetBeta-secretase 1
LigandBDBM50361381
Substrate/Competitorn/a
Meas. Tech.ChEMBL_795224 (CHEMBL1936883)
Ki 61600±n/a nM
Citation Marumoto, SMiyazawa, M Structure-activity relationships for naturally occurring coumarins asß-secretase inhibitor. Bioorg Med Chem20:784-8 (2012) 
 
Beta-secretase 1
Name:Beta-secretase 1
Type:Protein
Mol. Mass.:55755.10
Organism:Homo sapiens (Human)
Description:P56817
Residue:501
BDBM50361381
NameBDBM50361381
Synonyms:CHEMBL1412710
TypeSmall organic molecule
Emp. Form.C21H22O4
Mol. Mass.338.397
SMILES[#6]\[#6](-[#6])=[#6]\[#6]-[#6]\[#6](-[#6])=[#6]\[#6]-[#8]-c1c2occc2cc2ccc(=O)oc12