Reaction Details
TargetBeta-secretase 1
LigandBDBM50361390
Substrate/Competitorn/a
Meas. Tech.ChEMBL_795275 (CHEMBL1937035)
Ki 6200±n/a nM
Citation Marumoto, SMiyazawa, M Structure-activity relationships for naturally occurring coumarins asß-secretase inhibitor. Bioorg Med Chem20:784-8 (2012) 
 
Beta-secretase 1
Name:Beta-secretase 1
Type:Protein
Mol. Mass.:55755.10
Organism:Homo sapiens (Human)
Description:P56817
Residue:501
BDBM50361390
NameBDBM50361390
Synonyms:BYAKANGELICIN
TypeSmall organic molecule
Emp. Form.C17H18O7
Mol. Mass.334.3206
SMILESCOc1c2ccoc2c(OC[C@@H](O)C(C)(C)O)c2oc(=O)ccc12