Reaction Details
TargetPerforin-1
LigandBDBM50361411
Substrate/Competitorn/a
Meas. Tech.ChEMBL_794525 (CHEMBL1936847)
IC50 340±n/a nM
Citation Spicer, JAHuttunen, KMMiller, CKDenny, WACiccone, ABrowne, KATrapani, JA Inhibition of the pore-forming protein perforin by a series of aryl-substituted isobenzofuran-1(3H)-ones. Bioorg Med Chem20:1319-36 (2012) 
 
Perforin-1
Name:Perforin-1
Type:PROTEIN
Mol. Mass.:61392.32
Organism:Homo sapiens (Human)
Description:ChEMBL_1285138
Residue:555
BDBM50361411
NameBDBM50361411
Synonyms:CHEMBL1934375
TypeSmall organic molecule
Emp. Form.C15H9N3O3S2
Mol. Mass.343.38
SMILESO=C1NC(=S)NC1=Cc1csc(n1)-c1ccc2C(=O)OCc2c1