Reaction Details
TargetPerforin-1
LigandBDBM50361422
Substrate/Competitorn/a
Meas. Tech.ChEMBL_794525 (CHEMBL1936847)
IC50 470±n/a nM
Citation Spicer, JAHuttunen, KMMiller, CKDenny, WACiccone, ABrowne, KATrapani, JA Inhibition of the pore-forming protein perforin by a series of aryl-substituted isobenzofuran-1(3H)-ones. Bioorg Med Chem20:1319-36 (2012) 
 
Perforin-1
Name:Perforin-1
Type:PROTEIN
Mol. Mass.:61392.32
Organism:Homo sapiens (Human)
Description:ChEMBL_1285138
Residue:555
BDBM50361422
NameBDBM50361422
Synonyms:CHEMBL1934386
TypeSmall organic molecule
Emp. Form.C21H13N3O3S
Mol. Mass.387.411
SMILESO=C1NC(=S)NC1=Cc1ccc2cc(ccc2n1)-c1ccc2C(=O)OCc2c1