Reaction Details
TargetLysine-specific demethylase 4C
LigandBDBM50344962
Substrate/Competitorn/a
Meas. Tech.ChEMBL_797222 (CHEMBL1942537)
IC50 97000±n/a nM
Citation Suzuki, TMiyata, N Lysine demethylases inhibitors. J Med Chem54:8236-50 (2011) 
 
Lysine-specific demethylase 4C
Name:Lysine-specific demethylase 4C
Type:Protein
Mol. Mass.:119979.01
Organism:Homo sapiens (Human)
Description:Q9H3R0
Residue:1056
BDBM50344962
NameBDBM50344962
Synonyms:(2S)-2-HYDROXYPENTANEDIOIC ACID L-2-Hydroxyglutarate
TypeSmall organic molecule
Emp. Form.C5H8O5
Mol. Mass.148.114
SMILESO[C@@H](CCC(O)=O)C(O)=O