Reaction Details
TargetProlyl hydroxylase EGLN2
LigandBDBM26106
Substrate/Competitorn/a
Meas. Tech.ChEMBL_797226 (CHEMBL1942541)
IC50 2100±n/a nM
Citation Suzuki, TMiyata, N Lysine demethylases inhibitors. J Med Chem54:8236-50 (2011) 
 
Prolyl hydroxylase EGLN2
Name:Prolyl hydroxylase EGLN2
Type:Protein
Mol. Mass.:43657.01
Organism:Homo sapiens (Human)
Description:Q96KS0
Residue:407
BDBM26106
NameBDBM26106
Synonyms:CHEMBL90852 NOG [(carboxymethyl)carbamoyl]formic acid
TypeSmall organic molecule
Emp. Form.C4H5NO5
Mol. Mass.147.0862
SMILESOC(=O)CNC(=O)C(O)=O