Reaction Details
TargetLysine-specific demethylase 4A
LigandBDBM50306580
Substrate/Competitorn/a
Meas. Tech.ChEMBL_797220 (CHEMBL1942535)
IC50 12000±n/a nM
Citation Suzuki, TMiyata, N Lysine demethylases inhibitors. J Med Chem54:8236-50 (2011) 
 
Lysine-specific demethylase 4A
Name:Lysine-specific demethylase 4A
Type:Enzyme
Mol. Mass.:120647.83
Organism:Homo sapiens (Human)
Description:O75164
Residue:1064
BDBM50306580
NameBDBM50306580
Synonyms:(R)-3-(4-(4-bromophenylsulfonyloxy)phenyl)-2-(carboxyformamido)propanoic acid | CHEMBL602503
TypeSmall organic molecule
Emp. Form.C17H14BrNO8S
Mol. Mass.472.264
SMILESOC(=O)[C@@H](Cc1ccc(OS(=O)(=O)c2ccc(Br)cc2)cc1)NC(=O)C(O)=O