Reaction Details
TargetLysine-specific demethylase 4A
LigandBDBM50361475
Substrate/Competitorn/a
Meas. Tech.ChEMBL_797220 (CHEMBL1942535)
IC50 4300±n/a nM
Citation Suzuki, TMiyata, N Lysine demethylases inhibitors. J Med Chem54:8236-50 (2011) 
 
Lysine-specific demethylase 4A
Name:Lysine-specific demethylase 4A
Type:Enzyme
Mol. Mass.:120647.83
Organism:Homo sapiens (Human)
Description:O75164
Residue:1064
BDBM50361475
NameBDBM50361475
Synonyms:CHEMBL1938900
TypeSmall organic molecule
Emp. Form.C27H29N3O6
Mol. Mass.491.5357
SMILESON(CCCCNCc1ccc(COC(=O)Nc2cccc3ccccc23)cc1)C(=O)C=CC(O)=O