Reaction Details
TargetEgl nine homolog 1
LigandBDBM50361475
Substrate/Competitorn/a
Meas. Tech.ChEMBL_797224 (CHEMBL1942539)
IC50 83000±n/a nM
Citation Suzuki, TMiyata, N Lysine demethylases inhibitors. J Med Chem54:8236-50 (2011) 
 
Egl nine homolog 1
Name:Egl nine homolog 1
Type:Protein
Mol. Mass.:46035.59
Organism:Homo sapiens (Human)
Description:Q9GZT9
Residue:426
BDBM50361475
NameBDBM50361475
Synonyms:CHEMBL1938900
TypeSmall organic molecule
Emp. Form.C27H29N3O6
Mol. Mass.491.5357
SMILESON(CCCCNCc1ccc(COC(=O)Nc2cccc3ccccc23)cc1)C(=O)C=CC(O)=O