Reaction Details
TargetAmine oxidase [flavin-containing] B
LigandBDBM50346534
Substrate/Competitorn/a
Meas. Tech.ChEMBL_797216 (CHEMBL1942531)
Ki 740000±n/a nM
Citation Suzuki, TMiyata, N Lysine demethylases inhibitors. J Med Chem54:8236-50 (2011) 
 
Amine oxidase [flavin-containing] B
Name:Amine oxidase [flavin-containing] B
Type:Protein
Mol. Mass.:58768.76
Organism:Homo sapiens (Human)
Description:P27338
Residue:520
BDBM50346534
NameBDBM50346534
Synonyms:CHEMBL1797705
TypeSmall organic molecule
Emp. Form.C27H29N3O3
Mol. Mass.443.5375
SMILESN[C@H]1C[C@@H]1c1cccc(OCC[C@H](NC(=O)c2ccccc2)C(=O)NCc2ccccc2)c1