Reaction Details
TargetProstaglandin G/H synthase 2
LigandBDBM50361587
Substrate/Competitorn/a
Meas. Tech.ChEMBL_799066 (CHEMBL1941925)
IC50 17±n/a nM
Citation Biava, MPorretta, GCPoce, GBattilocchio, CAlfonso, SRovini, MValenti, SGiorgi, GCalderone, VMartelli, ATestai, LSautebin, LRossi, APapa, GGhelardini, CDi Cesare Mannelli, LGiordani, AAnzellotti, PBruno, APatrignani, PAnzini, M Novel analgesic/anti-inflammatory agents: diarylpyrrole acetic esters endowed with nitric oxide releasing properties. J Med Chem54:7759-71 (2011) 
 
Prostaglandin G/H synthase 2
Name:Prostaglandin G/H synthase 2
Type:Protein
Mol. Mass.:69020.39
Organism:Mus musculus (Mouse)
Description:Q05769
Residue:604
BDBM50361587
NameBDBM50361587
Synonyms:CHEMBL1939674
TypeSmall organic molecule
Emp. Form.C23H24N2O7S2
Mol. Mass.504.576
SMILESCSc1ccc(cc1)-n1c(C)c(CC(=O)OCCO[N+]([O-])=O)cc1-c1ccc(cc1)S(C)(=O)=O