Reaction Details
TargetAmine oxidase [flavin-containing] A
LigandBDBM50361610
Substrate/Competitorn/a
Meas. Tech.ChEMBL_799139 (CHEMBL1942123)
Ki 4±n/a nM
Citation Valente, STomassi, STempera, GSaccoccio, SAgostinelli, EMai, A Novel reversible monoamine oxidase A inhibitors: highly potent and selective 3-(1H-pyrrol-3-yl)-2-oxazolidinones. J Med Chem54:8228-32 (2011) 
 
Amine oxidase [flavin-containing] A
Name:Amine oxidase [flavin-containing] A
Type:PROTEIN
Mol. Mass.:59764.63
Organism:Bos taurus
Description:ChEMBL_1501477
Residue:527
BDBM50361610
NameBDBM50361610
Synonyms:CHEMBL1939854
TypeSmall organic molecule
Emp. Form.C11H13N5O2
Mol. Mass.247.2532
SMILESC=CCn1ccc(c1)N1C[C@H](CN=[N+]=[N-])OC1=O