Reaction Details
TargetAmine oxidase [flavin-containing] A
LigandBDBM50361612
Substrate/Competitorn/a
Meas. Tech.ChEMBL_799139 (CHEMBL1942123)
Ki 130±n/a nM
Citation Valente, STomassi, STempera, GSaccoccio, SAgostinelli, EMai, A Novel reversible monoamine oxidase A inhibitors: highly potent and selective 3-(1H-pyrrol-3-yl)-2-oxazolidinones. J Med Chem54:8228-32 (2011) 
 
Amine oxidase [flavin-containing] A
Name:Amine oxidase [flavin-containing] A
Type:PROTEIN
Mol. Mass.:59764.63
Organism:Bos taurus
Description:ChEMBL_1501477
Residue:527
BDBM50361612
NameBDBM50361612
Synonyms:CHEMBL1939856
TypeSmall organic molecule
Emp. Form.C10H15N3O2
Mol. Mass.209.245
SMILESCCn1ccc(c1)N1C[C@H](CN)OC1=O