Reaction Details
TargetAmine oxidase [flavin-containing] B
LigandBDBM50110725
Substrate/Competitorn/a
Meas. Tech.ChEMBL_799140 (CHEMBL1942124)
Ki 15000±n/a nM
Citation Valente, STomassi, STempera, GSaccoccio, SAgostinelli, EMai, A Novel reversible monoamine oxidase A inhibitors: highly potent and selective 3-(1H-pyrrol-3-yl)-2-oxazolidinones. J Med Chem54:8228-32 (2011) 
 
Amine oxidase [flavin-containing] B
Name:Amine oxidase [flavin-containing] B
Type:PROTEIN
Mol. Mass.:58428.94
Organism:Bos taurus
Description:ChEMBL_1501478
Residue:520
BDBM50110725
NameBDBM50110725
Synonyms:5-(hydroxymethyl)-3-(3-methylphenyl)-oxazolidin-2-one CHEMBL18116 Taloxotone
TypeSmall organic molecule
Emp. Form.C11H13NO3
Mol. Mass.207.2258
SMILESCc1cccc(c1)N1CC(CO)OC1=O