Reaction Details
TargetPhosphatidylinositol 4,5-bisphosphate 3-kinase catalytic subunit alpha isoform
LigandBDBM50361641
Substrate/Competitorn/a
Meas. Tech.ChEMBL_799342 (CHEMBL1942055)
Ki 650±n/a nM
Citation Murphy, STAlton, GBailey, SBaxi, SMBurke, BJChappie, TAErmolieff, JFerre, RGreasley, SHickey, MHumphrey, JKablaoui, NKath, JKazmirski, SKraus, MKupchinsky, SLi, JLingardo, LMarx, MARichter, DTanis, SPTran, KVernier, WXie, ZYin, MJYu, XH Discovery of novel, potent, and selective inhibitors of 3-phosphoinositide-dependent kinase (PDK1). J Med Chem54:8490-500 (2011) 
 
Phosphatidylinositol 4,5-bisphosphate 3-kinase catalytic subunit alpha isoform
Name:Phosphatidylinositol 4,5-bisphosphate 3-kinase catalytic subunit alpha isoform
Type:Protein
Mol. Mass.:124421.84
Organism:Mus musculus (Mouse)
Description:P42337
Residue:1068
BDBM50361641
NameBDBM50361641
Synonyms:CHEMBL1940247
TypeSmall organic molecule
Emp. Form.C26H28FN7O
Mol. Mass.473.5452
SMILESCC(C)n1cc(C(=O)c2cncc(n2)N(C)[C@@H]2CCC[C@@H]2c2ccc(F)cc2)c2c(N)ncnc12