Reaction Details
Target3-phosphoinositide-dependent protein kinase 1
LigandBDBM50361644
Substrate/Competitorn/a
Meas. Tech.ChEMBL_799412 (CHEMBL1942164)
IC50 200±n/a nM
Citation Murphy, STAlton, GBailey, SBaxi, SMBurke, BJChappie, TAErmolieff, JFerre, RGreasley, SHickey, MHumphrey, JKablaoui, NKath, JKazmirski, SKraus, MKupchinsky, SLi, JLingardo, LMarx, MARichter, DTanis, SPTran, KVernier, WXie, ZYin, MJYu, XH Discovery of novel, potent, and selective inhibitors of 3-phosphoinositide-dependent kinase (PDK1). J Med Chem54:8490-500 (2011) 
 
3-phosphoinositide-dependent protein kinase 1
Name:3-phosphoinositide-dependent protein kinase 1
Type:Enzyme
Mol. Mass.:63157.65
Organism:Homo sapiens (Human)
Description:O15530
Residue:556
BDBM50361644
NameBDBM50361644
Synonyms:CHEMBL1940253
TypeSmall organic molecule
Emp. Form.C26H28N8O2
Mol. Mass.484.5529
SMILESCC(C)n1cc(C(=O)c2cncc(N[C@@H]3CCN([C@@H]3c3ccccc3)C(C)=O)n2)c2c(N)ncnc12