Reaction Details
Target3-phosphoinositide-dependent protein kinase 1
LigandBDBM50361646
Substrate/Competitorn/a
Meas. Tech.ChEMBL_799415 (CHEMBL1942167)
Ki 100±n/a nM
Citation Murphy, STAlton, GBailey, SBaxi, SMBurke, BJChappie, TAErmolieff, JFerre, RGreasley, SHickey, MHumphrey, JKablaoui, NKath, JKazmirski, SKraus, MKupchinsky, SLi, JLingardo, LMarx, MARichter, DTanis, SPTran, KVernier, WXie, ZYin, MJYu, XH Discovery of novel, potent, and selective inhibitors of 3-phosphoinositide-dependent kinase (PDK1). J Med Chem54:8490-500 (2011) 
 
3-phosphoinositide-dependent protein kinase 1
Name:3-phosphoinositide-dependent protein kinase 1
Type:Enzyme
Mol. Mass.:63157.65
Organism:Homo sapiens (Human)
Description:O15530
Residue:556
BDBM50361646
NameBDBM50361646
Synonyms:CHEMBL1940243
TypeSmall organic molecule
Emp. Form.C15H17N7O
Mol. Mass.311.3418
SMILESCNc1cncc(n1)C(=O)c1cn(C(C)C)c2ncnc(N)c12