Reaction Details
Target3-phosphoinositide-dependent protein kinase 1
LigandBDBM50361651
Substrate/Competitorn/a
Meas. Tech.ChEMBL_799415 (CHEMBL1942167)
Ki 2.5±n/a nM
Citation Murphy, STAlton, GBailey, SBaxi, SMBurke, BJChappie, TAErmolieff, JFerre, RGreasley, SHickey, MHumphrey, JKablaoui, NKath, JKazmirski, SKraus, MKupchinsky, SLi, JLingardo, LMarx, MARichter, DTanis, SPTran, KVernier, WXie, ZYin, MJYu, XH Discovery of novel, potent, and selective inhibitors of 3-phosphoinositide-dependent kinase (PDK1). J Med Chem54:8490-500 (2011) 
 
3-phosphoinositide-dependent protein kinase 1
Name:3-phosphoinositide-dependent protein kinase 1
Type:Enzyme
Mol. Mass.:63157.65
Organism:Homo sapiens (Human)
Description:O15530
Residue:556
BDBM50361651
NameBDBM50361651
Synonyms:CHEMBL1940249
TypeSmall organic molecule
Emp. Form.C24H25FN8O
Mol. Mass.460.5067
SMILESCC(C)n1cc(C(=O)c2cncc(N[C@@H]3CNC[C@@H]3c3ccc(F)cc3)n2)c2c(N)ncnc12