Reaction Details
TargetHeat shock protein HSP 90-beta
LigandBDBM50361673
Substrate/Competitorn/a
Meas. Tech.ChEMBL_798935 (CHEMBL1943442)
IC50 130±n/a nM
Citation Baruchello, RSimoni, DGrisolia, GBarbato, GMarchetti, PRondanin, RMangiola, SGiannini, GBrunetti, TAlloatti, DGallo, GCiacci, AVesci, LCastorina, MMilazzo, FMCervoni, MLGuglielmi, MBBarbarino, MFoderà, RPisano, CCabri, W Novel 3,4-isoxazolediamides as potent inhibitors of chaperone heat shock protein 90. J Med Chem54:8592-604 (2011) 
 
Heat shock protein HSP 90-beta
Name:Heat shock protein HSP 90-beta
Type:Molecular Chaperone
Mol. Mass.:83229.45
Organism:Homo sapiens (Human)
Description:P08238
Residue:724
BDBM50361673
NameBDBM50361673
Synonyms:CHEMBL1940916
TypeSmall organic molecule
Emp. Form.C22H22ClN3O8
Mol. Mass.491.878
SMILESCCNC(=O)c1noc(c1NC(=O)c1cc(OC)c(OC)c(OC)c1)-c1cc(Cl)c(O)cc1O