Reaction Details
TargetHeat shock protein HSP 90-beta
LigandBDBM50361679
Substrate/Competitorn/a
Meas. Tech.ChEMBL_798935 (CHEMBL1943442)
IC50 160±n/a nM
Citation Baruchello, RSimoni, DGrisolia, GBarbato, GMarchetti, PRondanin, RMangiola, SGiannini, GBrunetti, TAlloatti, DGallo, GCiacci, AVesci, LCastorina, MMilazzo, FMCervoni, MLGuglielmi, MBBarbarino, MFoderà, RPisano, CCabri, W Novel 3,4-isoxazolediamides as potent inhibitors of chaperone heat shock protein 90. J Med Chem54:8592-604 (2011) 
 
Heat shock protein HSP 90-beta
Name:Heat shock protein HSP 90-beta
Type:Molecular Chaperone
Mol. Mass.:83229.45
Organism:Homo sapiens (Human)
Description:P08238
Residue:724
BDBM50361679
NameBDBM50361679
Synonyms:CHEMBL1940922
TypeSmall organic molecule
Emp. Form.C20H15ClF3N3O6
Mol. Mass.485.798
SMILESCOc1ccc(cc1)C(=O)Nc1c(noc1-c1cc(Cl)c(O)cc1O)C(=O)NCC(F)(F)F