Reaction Details
TargetHeat shock protein HSP 90-beta
LigandBDBM50361722
Substrate/Competitorn/a
Meas. Tech.ChEMBL_798935 (CHEMBL1943442)
IC50 48±n/a nM
Citation Baruchello, RSimoni, DGrisolia, GBarbato, GMarchetti, PRondanin, RMangiola, SGiannini, GBrunetti, TAlloatti, DGallo, GCiacci, AVesci, LCastorina, MMilazzo, FMCervoni, MLGuglielmi, MBBarbarino, MFoderà, RPisano, CCabri, W Novel 3,4-isoxazolediamides as potent inhibitors of chaperone heat shock protein 90. J Med Chem54:8592-604 (2011) 
 
Heat shock protein HSP 90-beta
Name:Heat shock protein HSP 90-beta
Type:Molecular Chaperone
Mol. Mass.:83229.45
Organism:Homo sapiens (Human)
Description:P08238
Residue:724
BDBM50361722
NameBDBM50361722
Synonyms:CHEMBL1941071
TypeSmall organic molecule
Emp. Form.C26H27N3O7
Mol. Mass.493.5085
SMILESCCNC(=O)c1noc(c1NC(=O)c1oc2ccc(OC)cc2c1C)-c1cc(C(C)C)c(O)cc1O