Reaction Details
TargetCarbonic anhydrase 9
LigandBDBM50174558
Substrate/Competitorn/a
Meas. Tech.ChEMBL_799273 (CHEMBL1941823)
Ki 478±n/a nM
Citation Touisni, NMaresca, AMcDonald, PCLou, YScozzafava, ADedhar, SWinum, JYSupuran, CT Glycosyl coumarin carbonic anhydrase IX and XII inhibitors strongly attenuate the growth of primary breast tumors. J Med Chem54:8271-7 (2011) 
 
Carbonic anhydrase 9
Name:Carbonic anhydrase 9
Type:Enzyme
Mol. Mass.:49669.03
Organism:Homo sapiens (Human)
Description:Catalytic domain of human cloned isozyme was used in the assay
Residue:459
BDBM50174558
NameBDBM50174558
Synonyms:7-hydroxy-2H-1-benzopyran-2-one CHEMBL51628 beta-umbelliferone skimmetin | umbelliferone
TypeSmall organic molecule
Emp. Form.C9H6O3
Mol. Mass.162.1421
SMILESOc1ccc2ccc(=O)oc2c1