Reaction Details
TargetCarbonic anhydrase 1
LigandBDBM50361738
Substrate/Competitorn/a
Meas. Tech.ChEMBL_799271 (CHEMBL1941821)
Ki 590±n/a nM
Citation Touisni, NMaresca, AMcDonald, PCLou, YScozzafava, ADedhar, SWinum, JYSupuran, CT Glycosyl coumarin carbonic anhydrase IX and XII inhibitors strongly attenuate the growth of primary breast tumors. J Med Chem54:8271-7 (2011) 
 
Carbonic anhydrase 1
Name:Carbonic anhydrase 1
Type:Enzyme
Mol. Mass.:28873.37
Organism:Homo sapiens (Human)
Description:P00915
Residue:261
BDBM50361738
NameBDBM50361738
Synonyms:CHEMBL1393422
TypeSmall organic molecule
Emp. Form.C16H18O8
Mol. Mass.338.3093
SMILESCc1cc(=O)oc2cc(O[C@@H]3O[C@H](CO)[C@H](O)[C@H](O)[C@H]3O)ccc12