Reaction Details
TargetCarbonic anhydrase 2
LigandBDBM50300203
Substrate/Competitorn/a
Meas. Tech.ChEMBL_799272 (CHEMBL1941822)
Ki 59±n/a nM
Citation Touisni, NMaresca, AMcDonald, PCLou, YScozzafava, ADedhar, SWinum, JYSupuran, CT Glycosyl coumarin carbonic anhydrase IX and XII inhibitors strongly attenuate the growth of primary breast tumors. J Med Chem54:8271-7 (2011) 
 
Carbonic anhydrase 2
Name:Carbonic anhydrase 2
Type:Enzyme
Mol. Mass.:29250.71
Organism:Homo sapiens (Human)
Description:P00918
Residue:260
BDBM50300203
NameBDBM50300203
Synonyms:(S)-6-(1-hydroxy-3-methylbutyl)-7-methoxy-2H-chromen-2-one CHEMBL572366
TypeSmall organic molecule
Emp. Form.C15H18O4
Mol. Mass.262.301
SMILESCOc1cc2oc(=O)ccc2cc1[C@@H](O)CC(C)C