Reaction Details
TargetCarbonic anhydrase 9
LigandBDBM50361737
Substrate/Competitorn/a
Meas. Tech.ChEMBL_799273 (CHEMBL1941823)
Ki 3200±n/a nM
Citation Touisni, NMaresca, AMcDonald, PCLou, YScozzafava, ADedhar, SWinum, JYSupuran, CT Glycosyl coumarin carbonic anhydrase IX and XII inhibitors strongly attenuate the growth of primary breast tumors. J Med Chem54:8271-7 (2011) 
 
Carbonic anhydrase 9
Name:Carbonic anhydrase 9
Type:Enzyme
Mol. Mass.:49669.03
Organism:Homo sapiens (Human)
Description:Catalytic domain of human cloned isozyme was used in the assay
Residue:459
BDBM50361737
NameBDBM50361737
Synonyms:CHEMBL1938470
TypeSmall organic molecule
Emp. Form.C15H16O7
Mol. Mass.308.2833
SMILESCc1cc(=O)oc2cc(O[C@@H]3OC[C@@H](O)[C@@H](O)[C@H]3O)ccc12