Reaction Details
TargetLysosomal Pro-X carboxypeptidase
LigandBDBM50361766
Substrate/Competitorn/a
Meas. Tech.ChEMBL_799449 (CHEMBL1942257)
IC50 0.9±n/a nM
Citation Graham, THShen, HCLiu, WXiong, YVerras, ABleasby, KBhatt, URChabin, RMChen, DChen, QGarcia-Calvo, MGeissler, WMHe, HLassman, MEShen, ZTong, XTung, ECXie, DXu, SColletti, SLTata, JRHale, JJPinto, SShen, DM The discovery of non-benzimidazole and brain-penetrant prolylcarboxypeptidase inhibitors. Bioorg Med Chem Lett22:658-65 (2011) 
 
Lysosomal Pro-X carboxypeptidase
Name:Lysosomal Pro-X carboxypeptidase
Type:Enzyme
Mol. Mass.:55805.19
Organism:Homo sapiens (Human)
Description:P42785
Residue:496
BDBM50361766
NameBDBM50361766
Synonyms:CHEMBL1938502
TypeSmall organic molecule
Emp. Form.C28H32ClN3O2
Mol. Mass.478.026
SMILESC[C@H](NC(=O)[C@@H](NC(=O)C(C)(C)N)[C@@H](C)c1ccc(cc1)-c1ccccc1)c1ccc(Cl)cc1