Reaction Details
TargetLysosomal Pro-X carboxypeptidase
LigandBDBM50361774
Substrate/Competitorn/a
Meas. Tech.ChEMBL_799449 (CHEMBL1942257)
IC50 0.6±n/a nM
Citation Graham, THShen, HCLiu, WXiong, YVerras, ABleasby, KBhatt, URChabin, RMChen, DChen, QGarcia-Calvo, MGeissler, WMHe, HLassman, MEShen, ZTong, XTung, ECXie, DXu, SColletti, SLTata, JRHale, JJPinto, SShen, DM The discovery of non-benzimidazole and brain-penetrant prolylcarboxypeptidase inhibitors. Bioorg Med Chem Lett22:658-65 (2011) 
 
Lysosomal Pro-X carboxypeptidase
Name:Lysosomal Pro-X carboxypeptidase
Type:Enzyme
Mol. Mass.:55805.19
Organism:Homo sapiens (Human)
Description:P42785
Residue:496
BDBM50361774
NameBDBM50361774
Synonyms:CHEMBL1938510
TypeSmall organic molecule
Emp. Form.C32H33ClN4O2
Mol. Mass.541.083
SMILESC[C@H]([C@H](NC(=O)C(C)(C)N)C(=O)NC(c1ccncc1)c1ccc(Cl)cc1)c1ccc(cc1)-c1ccccc1