Reaction Details
TargetGlutathione S-transferase A2
LigandBDBM50361797
Substrate/Competitorn/a
Meas. Tech.ChEMBL_799590 (CHEMBL1941296)
IC50 94200±n/a nM
Citation Wang, CHWu, HTCheng, HMYen, TJLu, IHChang, HCJao, SCShing, TKLi, WS Inhibition of glutathione S-transferase M1 by new gabosine analogues is essential for overcoming cisplatin resistance in lung cancer cells. J Med Chem54:8574-81 (2011) 
 
Glutathione S-transferase A2
Name:Glutathione S-transferase A2
Type:PROTEIN
Mol. Mass.:25667.17
Organism:Homo sapiens (Human)
Description:ChEMBL_799590
Residue:222
BDBM50361797
NameBDBM50361797
Synonyms:CHEMBL1938638
TypeSmall organic molecule
Emp. Form.C24H30O8
Mol. Mass.446.4902
SMILESCO[C@]1(C)O[C@H]2[C@@H](OC\C=C\c3ccccc3)C=C(COC(C)=O)C(=O)[C@@H]2O[C@@]1(C)OC