Reaction Details
TargetGlutathione S-transferase A2
LigandBDBM50361815
Substrate/Competitorn/a
Meas. Tech.ChEMBL_799590 (CHEMBL1941296)
IC50>100000±n/a nM
Citation Wang, CHWu, HTCheng, HMYen, TJLu, IHChang, HCJao, SCShing, TKLi, WS Inhibition of glutathione S-transferase M1 by new gabosine analogues is essential for overcoming cisplatin resistance in lung cancer cells. J Med Chem54:8574-81 (2011) 
 
Glutathione S-transferase A2
Name:Glutathione S-transferase A2
Type:PROTEIN
Mol. Mass.:25667.17
Organism:Homo sapiens (Human)
Description:ChEMBL_799590
Residue:222
BDBM50361815
NameBDBM50361815
Synonyms:CHEMBL1938622
TypeSmall organic molecule
Emp. Form.C13H20O7
Mol. Mass.288.2937
SMILESCO[C@]1(C)O[C@H]2[C@H](O)C(CC(=O)[C@@H]2O[C@@]1(C)OC)C=O