Reaction Details
TargetGlutathione S-transferase A2
LigandBDBM50361807
Substrate/Competitorn/a
Meas. Tech.ChEMBL_799590 (CHEMBL1941296)
IC50>100000±n/a nM
Citation Wang, CHWu, HTCheng, HMYen, TJLu, IHChang, HCJao, SCShing, TKLi, WS Inhibition of glutathione S-transferase M1 by new gabosine analogues is essential for overcoming cisplatin resistance in lung cancer cells. J Med Chem54:8574-81 (2011) 
 
Glutathione S-transferase A2
Name:Glutathione S-transferase A2
Type:PROTEIN
Mol. Mass.:25667.17
Organism:Homo sapiens (Human)
Description:ChEMBL_799590
Residue:222
BDBM50361807
NameBDBM50361807
Synonyms:CHEMBL1938625
TypeSmall organic molecule
Emp. Form.C16H18O6
Mol. Mass.306.3105
SMILESCC(=O)OCC1C[C@@H](OCc2ccccc2)C(=O)C(=O)C1O