Reaction Details
TargetTyrosine-protein kinase JAK2
LigandBDBM50361821
Substrate/Competitorn/a
Meas. Tech.ChEMBL_799677 (CHEMBL1941383)
IC50 1±n/a nM
Citation Schenkel, LBHuang, XCheng, ADeak, HLDoherty, EEmkey, RGu, YGunaydin, HKim, JLLee, JLoberg, ROlivieri, PPistillo, JTang, JWan, QWang, HLWang, SWWells, MCWu, BYu, VLiu, LGeuns-Meyer, S Discovery of potent and highly selective thienopyridine Janus kinase 2 inhibitors. J Med Chem54:8440-50 (2011) 
 
Tyrosine-protein kinase JAK2
Name:Tyrosine-protein kinase JAK2
Type:Protein
Mol. Mass.:130684.68
Organism:Homo sapiens (Human)
Description:O60674
Residue:1132
BDBM50361821
NameBDBM50361821
Synonyms:CHEMBL1938654
TypeSmall organic molecule
Emp. Form.C19H22N4O3S2
Mol. Mass.418.533
SMILESCNC(=O)c1cnc(N)c2cc(sc12)-c1ccc(cc1)S(=O)(=O)NC(C)(C)C