Reaction Details
TargetRibosomal protein S6 kinase alpha-3
LigandBDBM50361847
Substrate/Competitorn/a
Meas. Tech.ChEMBL_799760 (CHEMBL1941466)
IC50 340±n/a nM
Citation Boyer, SJBurke, JGuo, XKirrane, TMSnow, RJZhang, YSarko, CSoleymanzadeh, LSwinamer, AWestbrook, JDicapua, FPadyana, ACogan, DGao, AXiong, ZMadwed, JBKashem, MKugler, SO'Neill, MM Indole RSK inhibitors. Part 1: discovery and initial SAR. Bioorg Med Chem Lett22:733-7 (2011) 
 
Ribosomal protein S6 kinase alpha-3
Name:Ribosomal protein S6 kinase alpha-3
Type:Serine/threonine-protein kinase
Mol. Mass.:83740.03
Organism:Homo sapiens (Human)
Description:The human RSK2 sequence differed from the Genbank entry NM_004586 at one residue, V45G. The protein was cloned and purified from baculovirus expression system.
Residue:740
BDBM50361847
NameBDBM50361847
Synonyms:CHEMBL1938798 | US9150577, 190
TypeSmall organic molecule
Emp. Form.C22H18N4O2
Mol. Mass.370.4039
SMILESO=C(Nc1cnc2ccccc2c1)c1ccc2cc3C(=O)NCCCn3c2c1