Reaction Details
TargetSphingosine 1-phosphate receptor 3
LigandBDBM50361879
Substrate/Competitorn/a
Meas. Tech.ChEMBL_799841 (CHEMBL1941547)
EC50>25000±n/a nM
Citation Frohn, MCee, VJLanman, BAPickrell, AJGolden, JRivenzon-Segal, DMiddleton, SFiorino, MXu, HSchrag, MXu, YMcElvain, MMuller, KSiu, JBürli, R Novel 5- and 6-subtituted benzothiazoles with improved physicochemical properties: potent S1P¿? agonists with in vivo lymphocyte-depleting activity. Bioorg Med Chem Lett22:628-33 (2011) 
 
Sphingosine 1-phosphate receptor 3
Name:Sphingosine 1-phosphate receptor 3
Type:G Protein-Coupled Receptor (GPCR)
Mol. Mass.:42278.13
Organism:Homo sapiens (Human)
Description:Q99500
Residue:378
BDBM50361879
NameBDBM50361879
Synonyms:CHEMBL1938925
TypeSmall organic molecule
Emp. Form.C25H22FN3O2S
Mol. Mass.447.524
SMILESCC(c1ccc2nc(sc2c1)-c1ccc(CN2CC(C2)C(O)=O)cc1F)c1ccccn1