Reaction Details
TargetSphingosine 1-phosphate receptor 3
LigandBDBM50361886
Substrate/Competitorn/a
Meas. Tech.ChEMBL_799841 (CHEMBL1941547)
EC50 7420±n/a nM
Citation Frohn, MCee, VJLanman, BAPickrell, AJGolden, JRivenzon-Segal, DMiddleton, SFiorino, MXu, HSchrag, MXu, YMcElvain, MMuller, KSiu, JBürli, R Novel 5- and 6-subtituted benzothiazoles with improved physicochemical properties: potent S1P¿? agonists with in vivo lymphocyte-depleting activity. Bioorg Med Chem Lett22:628-33 (2011) 
 
Sphingosine 1-phosphate receptor 3
Name:Sphingosine 1-phosphate receptor 3
Type:G Protein-Coupled Receptor (GPCR)
Mol. Mass.:42278.13
Organism:Homo sapiens (Human)
Description:Q99500
Residue:378
BDBM50361886
NameBDBM50361886
Synonyms:CHEMBL1938932
TypeSmall organic molecule
Emp. Form.C22H20FN3O3S2
Mol. Mass.457.541
SMILESOC(=O)C1CN(Cc2ccc(-c3nc4ccc(cc4s3)C(=O)N3CCSC3)c(F)c2)C1