Reaction Details
TargetSphingosine 1-phosphate receptor 3
LigandBDBM50361890
Substrate/Competitorn/a
Meas. Tech.ChEMBL_799841 (CHEMBL1941547)
EC50 2680±n/a nM
Citation Frohn, MCee, VJLanman, BAPickrell, AJGolden, JRivenzon-Segal, DMiddleton, SFiorino, MXu, HSchrag, MXu, YMcElvain, MMuller, KSiu, JBürli, R Novel 5- and 6-subtituted benzothiazoles with improved physicochemical properties: potent S1P¿? agonists with in vivo lymphocyte-depleting activity. Bioorg Med Chem Lett22:628-33 (2011) 
 
Sphingosine 1-phosphate receptor 3
Name:Sphingosine 1-phosphate receptor 3
Type:G Protein-Coupled Receptor (GPCR)
Mol. Mass.:42278.13
Organism:Homo sapiens (Human)
Description:Q99500
Residue:378
BDBM50361890
NameBDBM50361890
Synonyms:CHEMBL1938936
TypeSmall organic molecule
Emp. Form.C24H24FN3O3S2
Mol. Mass.485.594
SMILESCC1(C)SCCN1C(=O)c1ccc2nc(sc2c1)-c1ccc(CN2CC(C2)C(O)=O)cc1F