Reaction Details
TargetSphingosine 1-phosphate receptor 3
LigandBDBM50335514
Substrate/Competitorn/a
Meas. Tech.ChEMBL_799841 (CHEMBL1941547)
EC50 888±n/a nM
Citation Frohn, MCee, VJLanman, BAPickrell, AJGolden, JRivenzon-Segal, DMiddleton, SFiorino, MXu, HSchrag, MXu, YMcElvain, MMuller, KSiu, JBürli, R Novel 5- and 6-subtituted benzothiazoles with improved physicochemical properties: potent S1P¿? agonists with in vivo lymphocyte-depleting activity. Bioorg Med Chem Lett22:628-33 (2011) 
 
Sphingosine 1-phosphate receptor 3
Name:Sphingosine 1-phosphate receptor 3
Type:G Protein-Coupled Receptor (GPCR)
Mol. Mass.:42278.13
Organism:Homo sapiens (Human)
Description:Q99500
Residue:378
BDBM50335514
NameBDBM50335514
Synonyms:1-((3-fluoro-4-(5-(1-phenylcyclopropyl)thiazolo[5,4-b]pyridin-2-yl)phenyl)methyl)azetidine-3-carboxylic acid | CHEMBL1651861
TypeSmall organic molecule
Emp. Form.C26H22FN3O2S
Mol. Mass.459.535
SMILESOC(=O)C1CN(Cc2ccc(-c3nc4ccc(nc4s3)C3(CC3)c3ccccc3)c(F)c2)C1