Reaction Details
TargetSphingosine 1-phosphate receptor 1
LigandBDBM50335512
Substrate/Competitorn/a
Meas. Tech.ChEMBL_799839 (CHEMBL1941545)
EC50 41±n/a nM
Citation Frohn, MCee, VJLanman, BAPickrell, AJGolden, JRivenzon-Segal, DMiddleton, SFiorino, MXu, HSchrag, MXu, YMcElvain, MMuller, KSiu, JBürli, R Novel 5- and 6-subtituted benzothiazoles with improved physicochemical properties: potent S1P¿? agonists with in vivo lymphocyte-depleting activity. Bioorg Med Chem Lett22:628-33 (2011) 
 
Sphingosine 1-phosphate receptor 1
Name:Sphingosine 1-phosphate receptor 1
Type:Enzyme
Mol. Mass.:42836.02
Organism:Homo sapiens (Human)
Description:P21453
Residue:382
BDBM50335512
NameBDBM50335512
Synonyms:1-(4-(5-benzylbenzo[d]thiazol-2-yl)-3-fluorobenzyl)azetidine-3-carboxylic acid | CHEMBL1651850
TypeSmall organic molecule
Emp. Form.C25H21FN2O2S
Mol. Mass.432.51
SMILESOC(=O)C1CN(Cc2ccc(-c3nc4cc(Cc5ccccc5)ccc4s3)c(F)c2)C1