Reaction Details
TargetSphingosine 1-phosphate receptor 1
LigandBDBM50361889
Substrate/Competitorn/a
Meas. Tech.ChEMBL_799839 (CHEMBL1941545)
EC50 49±n/a nM
Citation Frohn, MCee, VJLanman, BAPickrell, AJGolden, JRivenzon-Segal, DMiddleton, SFiorino, MXu, HSchrag, MXu, YMcElvain, MMuller, KSiu, JBürli, R Novel 5- and 6-subtituted benzothiazoles with improved physicochemical properties: potent S1P¿? agonists with in vivo lymphocyte-depleting activity. Bioorg Med Chem Lett22:628-33 (2011) 
 
Sphingosine 1-phosphate receptor 1
Name:Sphingosine 1-phosphate receptor 1
Type:Enzyme
Mol. Mass.:42836.02
Organism:Homo sapiens (Human)
Description:P21453
Residue:382
BDBM50361889
NameBDBM50361889
Synonyms:CHEMBL1938935
TypeSmall organic molecule
Emp. Form.C25H26FN3O3S2
Mol. Mass.499.621
SMILESCC(C)C1SCCN1C(=O)c1ccc2nc(sc2c1)-c1ccc(CN2CC(C2)C(O)=O)cc1F