Reaction Details
TargetC-C chemokine receptor type 1
LigandBDBM50361926
Substrate/Competitorn/a
Meas. Tech.ChEMBL_800100 (CHEMBL1941991)
EC50 2000±n/a nM
Citation Ukani, RLewis, TCDay, TPWu, WMalladi, SSWarshakoon, HJDavid, SA Potent adjuvantic activity of a CCR1-agonistic bis-quinoline. Bioorg Med Chem Lett22:293-5 (2011) 
 
C-C chemokine receptor type 1
Name:C-C chemokine receptor type 1
Type:Enzyme
Mol. Mass.:41180.69
Organism:Homo sapiens (Human)
Description:P32246
Residue:355
BDBM50361926
NameBDBM50361926
Synonyms:CHEMBL66165
TypeSmall organic molecule
Emp. Form.C22H20Cl2N4
Mol. Mass.411.327
SMILESClc1ccc2c(NCCCCNc3ccnc4cc(Cl)ccc34)ccnc2c1