Reaction Details
TargetC-X-C chemokine receptor type 3
LigandBDBM50361983
Substrate/Competitorn/a
Meas. Tech.ChEMBL_799099 (CHEMBL1942040)
IC50 4.1±n/a nM
Citation Chen, XMihalic, JDeignan, JGustin, DJDuquette, JDu, XChan, JFu, ZJohnson, MLi, ARHenne, KSullivan, TLemon, BMa, JMiao, STonn, GCollins, TMedina, JC Discovery of potent and specific CXCR3 antagonists. Bioorg Med Chem Lett22:357-62 (2011) 
 
C-X-C chemokine receptor type 3
Name:C-X-C chemokine receptor type 3
Type:Enzyme Catalytic Domain
Mol. Mass.:40665.65
Organism:Homo sapiens (Human)
Description:n/a
Residue:368
BDBM50361983
NameBDBM50361983
Synonyms:CHEMBL1939697
TypeSmall organic molecule
Emp. Form.C30H24F3N5O4
Mol. Mass.575.5379
SMILESC[C@@H](N(Cc1cccnc1)C(=O)Cc1ccc(OC(F)(F)F)cc1)c1nc2ncccc2c(=O)n1-c1ccc(O)cc1