Reaction Details
TargetC-X-C chemokine receptor type 3
LigandBDBM50361988
Substrate/Competitorn/a
Meas. Tech.ChEMBL_799098 (CHEMBL1942039)
IC50 6±n/a nM
Citation Chen, XMihalic, JDeignan, JGustin, DJDuquette, JDu, XChan, JFu, ZJohnson, MLi, ARHenne, KSullivan, TLemon, BMa, JMiao, STonn, GCollins, TMedina, JC Discovery of potent and specific CXCR3 antagonists. Bioorg Med Chem Lett22:357-62 (2011) 
 
C-X-C chemokine receptor type 3
Name:C-X-C chemokine receptor type 3
Type:Enzyme Catalytic Domain
Mol. Mass.:40665.65
Organism:Homo sapiens (Human)
Description:n/a
Residue:368
BDBM50361988
NameBDBM50361988
Synonyms:CHEMBL1939559
TypeSmall organic molecule
Emp. Form.C30H27ClF4N4O4S
Mol. Mass.651.071
SMILESC[C@@H](N(CC1CCS(=O)(=O)CC1)C(=O)Cc1ccc(F)c(c1)C(F)(F)F)c1nc2ncccc2c(=O)n1-c1ccc(Cl)cc1