Reaction Details
TargetC-X-C chemokine receptor type 3
LigandBDBM50361980
Substrate/Competitorn/a
Meas. Tech.ChEMBL_799098 (CHEMBL1942039)
IC50 6±n/a nM
Citation Chen, XMihalic, JDeignan, JGustin, DJDuquette, JDu, XChan, JFu, ZJohnson, MLi, ARHenne, KSullivan, TLemon, BMa, JMiao, STonn, GCollins, TMedina, JC Discovery of potent and specific CXCR3 antagonists. Bioorg Med Chem Lett22:357-62 (2011) 
 
C-X-C chemokine receptor type 3
Name:C-X-C chemokine receptor type 3
Type:Enzyme Catalytic Domain
Mol. Mass.:40665.65
Organism:Homo sapiens (Human)
Description:n/a
Residue:368
BDBM50361980
NameBDBM50361980
Synonyms:CHEMBL1939555
TypeSmall organic molecule
Emp. Form.C32H29F3N4O5S
Mol. Mass.638.657
SMILESC[C@@H](N(CC1CCS(=O)(=O)CC1)C(=O)Cc1ccc(OC(F)(F)F)cc1)c1nc2ccccn2c(=O)c1-c1ccc(cc1)C#N