Reaction Details
TargetSigma non-opioid intracellular receptor 1
LigandBDBM50361993
Substrate/Competitorn/a
Meas. Tech.ChEMBL_799943 (CHEMBL1941649)
Ki 0.140000±n/a nM
Citation Maisonial, AGrosse Maestrup, EWiese, CHiller, ASchepmann, DFischer, SDeuther-Conrad, WSteinbach, JBrust, PWünsch, B Synthesis, radiofluorination and pharmacological evaluation of a fluoromethyl spirocyclic PET tracer for centrals1 receptors and comparison with fluoroalkyl homologs. Bioorg Med Chem20:257-69 (2011) 
 
Sigma non-opioid intracellular receptor 1
Name:Sigma non-opioid intracellular receptor 1
Type:Protein
Mol. Mass.:25307.17
Organism:Cavia porcellus (Guinea pig)
Description:Q60492
Residue:223
BDBM50361993
NameBDBM50361993
Synonyms:CHEMBL1939700
TypeSmall organic molecule
Emp. Form.C20H21F2NO
Mol. Mass.329.3836
SMILESFCC1OC2(CCN(Cc3ccc(F)cc3)CC2)c2ccccc12