Reaction Details
TargetMet repressor
LigandBDBM50362019
Substrate/Competitorn/a
Meas. Tech.ChEMBL_799628 (CHEMBL1941334)
EC50 108±n/a nM
Citation Joce, CWhite, RStockley, PGWarriner, STurnbull, WBNelson, A Design, synthesis and in vitro evaluation of novel bivalent S-adenosylmethionine analogues. Bioorg Med Chem Lett22:278-84 (2011) 
 
Met repressor
Name:Met repressor
Synonyms:Met regulon regulatory protein MetJ
Type:PROTEIN
Mol. Mass.:12138.09
Organism:Escherichia coli
Description:ChEMBL_799627
Residue:105
BDBM50362019
NameBDBM50362019
Synonyms:CHEMBL1939727
TypeSmall organic molecule
Emp. Form.C35H56N14O8
Mol. Mass.800.907
SMILESC[N+](C)(CCCC(=O)NCCCNC(=O)CCC[N+](C)(C)C[C@H]1O[C@H]([C@H](O)[C@@H]1O)n1cnc2c(N)ncnc12)C[C@H]1O[C@H]([C@H](O)[C@@H]1O)n1cnc2c(N)ncnc12