Reaction Details
TargetMet repressor
LigandBDBM28422
Substrate/Competitorn/a
Meas. Tech.ChEMBL_799628 (CHEMBL1941334)
EC50 17±n/a nM
Citation Joce, CWhite, RStockley, PGWarriner, STurnbull, WBNelson, A Design, synthesis and in vitro evaluation of novel bivalent S-adenosylmethionine analogues. Bioorg Med Chem Lett22:278-84 (2011) 
 
Met repressor
Name:Met repressor
Synonyms:Met regulon regulatory protein MetJ
Type:PROTEIN
Mol. Mass.:12138.09
Organism:Escherichia coli
Description:ChEMBL_799627
Residue:105
BDBM28422
NameBDBM28422
Typeradiolabeled substrate
Emp. Form.C15H22N6O5S
Mol. Mass.398.437
SMILESC[S+](CC[C@H](N)C([O-])=O)C[C@H]1O[C@H]([C@H](O)[C@@H]1O)n1cnc2c(N)ncnc12