Reaction Details
TargetcAMP and cAMP-inhibited cGMP 3',5'-cyclic phosphodiesterase 10A
LigandBDBM50362051
Substrate/Competitorn/a
Meas. Tech.ChEMBL_797299 (CHEMBL1942791)
Ki 41±n/a nM
Citation Yang, SWSmotryski, JMcElroy, WTTan, ZHo, GTulshian, DGreenlee, WJGuzzi, MZhang, XMullins, DXiao, LHruza, AChan, TMRindgen, DBleickardt, CHodgson, R Discovery of orally active pyrazoloquinolines as potent PDE10 inhibitors for the management of schizophrenia. Bioorg Med Chem Lett22:235-9 (2011) 
 
cAMP and cAMP-inhibited cGMP 3',5'-cyclic phosphodiesterase 10A
Name:cAMP and cAMP-inhibited cGMP 3',5'-cyclic phosphodiesterase 10A
Type:Protein
Mol. Mass.:88412.52
Organism:Homo sapiens (Human)
Description:Q9Y233
Residue:779
BDBM50362051
NameBDBM50362051
Synonyms:CHEMBL1940061
TypeSmall organic molecule
Emp. Form.C18H21ClN4O
Mol. Mass.344.839
SMILESCc1n[nH]c2nc3c(C)cc(Cl)cc3c(CN3CCCOCC3)c12