Reaction Details
TargetDual specificity calcium/calmodulin-dependent 3',5'-cyclic nucleotide phosphodiesterase 1A
LigandBDBM50362048
Substrate/Competitorn/a
Meas. Tech.ChEMBL_797284 (CHEMBL1942685)
Ki>10000±n/a nM
Citation Yang, SWSmotryski, JMcElroy, WTTan, ZHo, GTulshian, DGreenlee, WJGuzzi, MZhang, XMullins, DXiao, LHruza, AChan, TMRindgen, DBleickardt, CHodgson, R Discovery of orally active pyrazoloquinolines as potent PDE10 inhibitors for the management of schizophrenia. Bioorg Med Chem Lett22:235-9 (2011) 
 
Dual specificity calcium/calmodulin-dependent 3',5'-cyclic nucleotide phosphodiesterase 1A
Name:Dual specificity calcium/calmodulin-dependent 3',5'-cyclic nucleotide phosphodiesterase 1A
Type:Protein
Mol. Mass.:61245.69
Organism:Homo sapiens (Human)
Description:P54750
Residue:535
BDBM50362048
NameBDBM50362048
Synonyms:CHEMBL1940058
TypeSmall organic molecule
Emp. Form.C21H28N4O2
Mol. Mass.368.4726
SMILESCC(C)Oc1cc(C)c2nc3[nH]nc(C)c3c(CN3CCCOCC3)c2c1