Reaction Details
TargetcAMP-specific 3',5'-cyclic phosphodiesterase 4B
LigandBDBM50362048
Substrate/Competitorn/a
Meas. Tech.ChEMBL_798764 (CHEMBL1942899)
Ki>10000±n/a nM
Citation Yang, SWSmotryski, JMcElroy, WTTan, ZHo, GTulshian, DGreenlee, WJGuzzi, MZhang, XMullins, DXiao, LHruza, AChan, TMRindgen, DBleickardt, CHodgson, R Discovery of orally active pyrazoloquinolines as potent PDE10 inhibitors for the management of schizophrenia. Bioorg Med Chem Lett22:235-9 (2011) 
 
cAMP-specific 3',5'-cyclic phosphodiesterase 4B
Name:cAMP-specific 3',5'-cyclic phosphodiesterase 4B
Type:Protein
Mol. Mass.:83318.87
Organism:Homo sapiens (Human)
Description:Q07343
Residue:736
BDBM50362048
NameBDBM50362048
Synonyms:CHEMBL1940058
TypeSmall organic molecule
Emp. Form.C21H28N4O2
Mol. Mass.368.4726
SMILESCC(C)Oc1cc(C)c2nc3[nH]nc(C)c3c(CN3CCCOCC3)c2c1