Reaction Details
TargetHigh affinity cAMP-specific and IBMX-insensitive 3',5'-cyclic phosphodiesterase 8A
LigandBDBM50362036
Substrate/Competitorn/a
Meas. Tech.ChEMBL_798761 (CHEMBL1942896)
Ki>10000±n/a nM
Citation Yang, SWSmotryski, JMcElroy, WTTan, ZHo, GTulshian, DGreenlee, WJGuzzi, MZhang, XMullins, DXiao, LHruza, AChan, TMRindgen, DBleickardt, CHodgson, R Discovery of orally active pyrazoloquinolines as potent PDE10 inhibitors for the management of schizophrenia. Bioorg Med Chem Lett22:235-9 (2011) 
 
High affinity cAMP-specific and IBMX-insensitive 3',5'-cyclic phosphodiesterase 8A
Name:High affinity cAMP-specific and IBMX-insensitive 3',5'-cyclic phosphodiesterase 8A
Type:Enzyme Catalytic Domain
Mol. Mass.:93295.89
Organism:Homo sapiens (Human)
Description:Recombinant catalytic domain (M1-E829) of human PDE8A.
Residue:829
BDBM50362036
NameBDBM50362036
Synonyms:CHEMBL1939915
TypeSmall organic molecule
Emp. Form.C19H24N4O2
Mol. Mass.340.4195
SMILESCOc1cc(C)c2nc3[nH]nc(C)c3c(CN3CCOC(C)C3)c2c1