Reaction Details
TargetVascular endothelial growth factor receptor 3
LigandBDBM50362089
Substrate/Competitorn/a
Meas. Tech.ChEMBL_797354 (CHEMBL1942930)
IC50 12±n/a nM
Citation Plé, PAJung, FAshton, SHennequin, LLaine, RMorgentin, RPasquet, GTaylor, S Discovery of AZD2932, a new Quinazoline Ether Inhibitor with high affinity for VEGFR-2 and PDGFR tyrosine kinases. Bioorg Med Chem Lett22:262-6 (2011) 
 
Vascular endothelial growth factor receptor 3
Name:Vascular endothelial growth factor receptor 3
Type:Protein
Mol. Mass.:152749.58
Organism:Homo sapiens (Human)
Description:P35916-2
Residue:1363
BDBM50362089
NameBDBM50362089
Synonyms:CHEMBL1940273
TypeSmall organic molecule
Emp. Form.C24H24N4O4
Mol. Mass.432.4718
SMILESCCn1cc(NC(=O)Cc2ccc(Oc3ccnc4cc(OC)c(OC)cc34)cc2)cn1